dmd-HEAD-2017-08-12 02:30:00 JST Failed
Container status code is not 0
=== Subako Build Script Base ===
 - reuse:          0
 - version:        HEAD
 - target system:  x86_64-linux-gnu
 - target arch:    x86_64
 - install path:   /usr/local/procgarden
 - packages path:  /etc/torigoya_pkgs
 - cpu core:       2
 - install prefix: /usr/local/procgarden/dmd.HEAD
 - package name:   dmd
 - package prefix: procgarden-
 - dep pkg name:          
 - dep pkg version:       
 - dep pkg gen name:      
 - dep pkg gen version:   
 - dep pkg disp version:  
 - dep pkg path:          
================================
base script is imported
From https://github.com/D-Programming-Language/dmd
 * [new tag]         v1.081.0   -> v1.081.0
 * [new tag]         v2.075.1   -> v2.075.1
HEAD is now at 09cd19d Merge pull request #7076 from WalterBright/fix17388
From https://github.com/D-Programming-Language/druntime
 * [new tag]         v2.075.1   -> v2.075.1
HEAD is now at 4575297 Merge pull request #1899 from MartinNowak/array_pow
From https://github.com/D-Programming-Language/phobos
 * [new tag]         v2.075.1   -> v2.075.1
HEAD is now at aa8c61f Merge pull request #5679 from RazvanN7/Issue_2137
DisplayVersion => git(09cd19d51b) [built=2017/08/12 02:30:22]
no cpu specified, assuming X86
  (CC)  BACK_OBJS  ddmd/backend/cgcod.c
c++ -c -o../generated/linux/release/64/cgcod.o -Wno-deprecated -Wstrict-aliasing -fno-exceptions -fno-rtti -D__pascal= -DMARS=1 -DTARGET_LINUX=1 -DDM_TARGET_CPU_X86=1 -m64 -Iddmd/root -Iddmd/tk -Iddmd/backend -I../generated/linux/release/64 -Iddmd -DDMDV2=1 -MMD -MF ../generated/linux/release/64/cgcod.deps ddmd/backend/cgcod.c
mkdir -p /tmp/.host_dmd-2.072.2
curl -fsSL http://downloads.dlang.org/releases/2.x/2.072.2/dmd.2.072.2.linux.tar.xz | tar -C /tmp/.host_dmd-2.072.2 -Jxf - || rm -rf /tmp/.host_dmd-2.072.2
In file included from ddmd/backend/cgcod.c:2591:0:
ddmd/backend/cdxxx.c:1:39: error: conflicting declaration ‘code* (* cdxxx [181])(elem*, regm_t*)’
 code *(*cdxxx[OPMAX]) (elem *,regm_t *) = 
                                       ^
In file included from ddmd/backend/cgcod.c:26:0:
ddmd/backend/code.h:238:15: error: ‘cdxxx’ has a previous declaration as ‘void (* cdxxx [])(CodeBuilder&, elem*, regm_t*)’
 extern  void(*cdxxx[])(CodeBuilder&,elem *,regm_t *);
               ^
make: *** [../generated/linux/release/64/cgcod.o] Error 1
make: *** Waiting for unfinished jobs....
Exit Status => 255
Error occured => Container status code is not 0